Target
Tyrosine-protein kinase JAK2
Ligand
BDBM50389320
Substrate
Meas. Tech.
ChEMBL_831787 (CHEMBL2065150)
IC50
<10000±n/a nM
Citation
 Maryanoff, BEO'Neill, JCMcComsey, DFYabut, SCLuci, DKGibbs, ACConnelly, MA Pyrimidinopyrimidine inhibitors of ketohexokinase: exploring the ring C2 group that interacts with Asp-27B in the ligand binding pocket. Bioorg Med Chem Lett 22:5326-9 (2012)  
Target
Name:
Tyrosine-protein kinase JAK2
Synonyms:
JAK-2 JAK2_HUMAN Janus kinase 2 (JAK2) | Janus kinase 2 (a protein tyrosine kinase)
Type:
Protein
Mol. Mass.:
130684.68
Organism:
Homo sapiens (Human)
Description:
O60674
Residue:
1132
  
Inhibitor
Name:
BDBM50389320
Synonyms:
CHEMBL2063926
Type:
Small organic molecule
Emp. Form.:
C26H35N9S
Mol. Mass.:
505.681
SMILES:
CSc1ccccc1Nc1nc(nc2c(NCC3CC3)ncnc12)N1CCN(CC1)C1CCNCC1
: