Target
Acetylcholinesterase
Ligand
BDBM50389633
Substrate
Meas. Tech.
ChEMBL_834152 (CHEMBL2072892)
IC50
19.2±n/a nM
Citation
 Anand, PSingh, B Synthesis and evaluation of novel 4-[(3H,3aH,6aH)-3-phenyl)-4,6-dioxo-2-phenyldihydro-2H-pyrrolo[3,4-d]isoxazol-5(3H,6H,6aH)-yl]benzoic acid derivatives as potent acetylcholinesterase inhibitors and anti-amnestic agents. Bioorg Med Chem 20:521-30 (2011)  
Target
Name:
Acetylcholinesterase
Synonyms:
ACES_RAT Acetylcholinesterase and butyrylcholinesterase (AChE and BChE) Acetylcholinesterase, AChE | Ache
Type:
Enzyme
Mol. Mass.:
68193.62
Organism:
Rattus norvegicus (rat)
Description:
P37136
Residue:
614
  
Inhibitor
Name:
BDBM50389633
Synonyms:
CHEMBL2069770 | CHEMBL2069792
Type:
Small organic molecule
Emp. Form.:
C25H19ClN2O5
Mol. Mass.:
462.882
SMILES:
Cc1ccc(cc1)N1Oc2c(O)n(c(O)c2[C@@H]1c1ccc(Cl)cc1)-c1ccc(cc1)C(O)=O
: