Target
Melanocortin receptor 5
Ligand
BDBM50389780
Substrate
Meas. Tech.
ChEMBL_834299 (CHEMBL2073119)
Ki
2.9±n/a nM
Citation
 Conde-Frieboes, KThøgersen, HLau, JFSensfuss, UHansen, TKChristensen, LSpetzler, JOlsen, HBNilsson, CRaun, KDahl, KHansen, BSWulff, BS Identification and in vivo and in vitro characterization of long acting and melanocortin 4 receptor (MC4-R) selectivea-melanocyte-stimulating hormone (a-MSH) analogues. J Med Chem 55:1969-77 (2012)  
Target
Name:
Melanocortin receptor 5
Synonyms:
MC-2 MC5R Melanocortin MC5 Melanocortin receptor 5 | Melanocortin receptor 5 (MC5R)
Type:
Enzyme
Mol. Mass.:
36612.92
Organism:
Homo sapiens (Human)
Description:
P33032
Residue:
325
  
Inhibitor
Name:
BDBM50389780
Synonyms:
CHEMBL2069317
Type:
Small organic molecule
Emp. Form.:
C92H143N27O20
Mol. Mass.:
1947.2887
SMILES:
CCCC[C@H](NC(=O)[C@H](CN(C)C)NC(=O)[C@H](Cc1cnc[nH]1)NC(=O)[C@H](CCC(N)=O)NC(=O)[C@H](CO)NC(=O)CNC(=O)COCCOCCNC(=O)CCCCCCCCCCCCCCCc1nnn[nH]1)C(=O)N[C@H]1CCC(=O)NCCCC[C@H](NC(=O)[C@H](Cc2c[nH]c3ccccc23)NC(=O)[C@H](CCCN=C(N)N)NC(=O)[C@@H](Cc2ccccc2)NC(=O)[C@@H]2C[C@@H](O)CN2C1=O)C(N)=O
: