Target
Adenosine receptor A3
Ligand
BDBM50389894
Substrate
Meas. Tech.
ChEMBL_834863 (CHEMBL2073180)
Ki
3.9±n/a nM
Citation
 Baraldi, PGSaponaro, GRomagnoli, RAghazadeh Tabrizi, MBaraldi, SMoorman, ARCosconati, SDi Maro, SMarinelli, LGessi, SMerighi, SVarani, KBorea, PAPreti, D Water-soluble pyrazolo[4,3-e][1,2,4]triazolo[1,5-c]pyrimidines as human A3 adenosine receptor antagonists. J Med Chem 55:5380-90 (2012)  
Target
Name:
Adenosine receptor A3
Synonyms:
A3 adenosine receptor (hA3) ADORA3 | Adenosine A3 receptor (A3AR)
Type:
G Protein-Coupled Receptor (GPCR)
Mol. Mass.:
36197.32
Organism:
Homo sapiens (Human)
Description:
P0DMS8
Residue:
318
  
Inhibitor
Name:
BDBM50389894
Synonyms:
CHEMBL2071048
Type:
Small organic molecule
Emp. Form.:
C26H28N10O3
Mol. Mass.:
528.5657
SMILES:
Cc1ccc(CNC(=O)N2CCC(CC2)NC(=O)Nc2nc3nn(C)cc3c3nc(nn23)-c2ccco2)cc1
: