Target
Adenosine receptor A3
Ligand
BDBM85618
Substrate
Meas. Tech.
ChEMBL_834863 (CHEMBL2073180)
Ki
0.29±n/a nM
Citation
 Baraldi, PGSaponaro, GRomagnoli, RAghazadeh Tabrizi, MBaraldi, SMoorman, ARCosconati, SDi Maro, SMarinelli, LGessi, SMerighi, SVarani, KBorea, PAPreti, D Water-soluble pyrazolo[4,3-e][1,2,4]triazolo[1,5-c]pyrimidines as human A3 adenosine receptor antagonists. J Med Chem 55:5380-90 (2012)  
Target
Name:
Adenosine receptor A3
Synonyms:
A3 adenosine receptor (hA3) ADORA3 | Adenosine A3 receptor (A3AR)
Type:
G Protein-Coupled Receptor (GPCR)
Mol. Mass.:
36197.32
Organism:
Homo sapiens (Human)
Description:
P0DMS8
Residue:
318
  
Inhibitor
Name:
BDBM85618
Synonyms:
CHEMBL302765 MRE 3008F20
Type:
Small organic molecule
Emp. Form.:
C21H20N8O3
Mol. Mass.:
432.4353
SMILES:
CCCn1cc2c(n1)nc(NC(=O)Nc1ccc(OC)cc1)n1nc(nc21)-c1ccco1
: