Target
Solute carrier family 15 member 1
Ligand
BDBM50016695
Substrate
Meas. Tech.
ChEMBL_835966 (CHEMBL2077104)
Ki
78000±n/a nM
Citation
 Ramamoorthy, SLiu, WMa, YYYang-Feng, TLGanapathy, VLeibach, FH Proton/peptide cotransporter (PEPT 2) from human kidney: functional characterization and chromosomal localization. Biochim Biophys Acta 1240:1-4 (1996)  
Target
Name:
Solute carrier family 15 member 1
Synonyms:
Intestinal H(+)/peptide cotransporter Oligopeptide transporter, small intestine isoform Peptide transporter 1 SLC15A1
Type:
PROTEIN
Mol. Mass.:
78818.07
Organism:
Homo sapiens (Human)
Description:
ChEMBL_1488839
Residue:
708
  
Inhibitor
Name:
BDBM50016695
Synonyms:
(2S)-2-{[(2S)-2-aminopropanoyl]amino}propanoic acid Ala-Ala | CHEMBL17697
Type:
Small organic molecule
Emp. Form.:
C6H12N2O3
Mol. Mass.:
160.1711
SMILES:
C[C@H](N)C(=O)N[C@@H](C)C(O)=O
: