Target
Cyclin-dependent kinase 5 activator 1
Ligand
BDBM50391200
Substrate
Meas. Tech.
ChEMBL_840813 (CHEMBL2090596)
IC50
>10000±n/a nM
Citation
 Bruel, ALogé, CTauzia, MLRavache, MLe Guevel, RGuillouzo, CLohier, JFOliveira Santos, JSLozach, OMeijer, LRuchaud, SBénédetti, HRobert, JM Synthesis and biological evaluation of new 5-benzylated 4-oxo-3,4-dihydro-5H-pyridazino[4,5-b]indoles as PI3Ka inhibitors. Eur J Med Chem 57:225-33 (2012)  
Target
Name:
Cyclin-dependent kinase 5 activator 1
Synonyms:
CDK5/p35 Cyclin-dependent kinase 5 regulatory subunit 1 | Cyclin-dependent kinase 5/CDK5 activator 1
Type:
Protein Complex
Mol. Mass.:
Description:
Components:
This complex has 2 components.
Component 1
Name:
Cyclin-dependent kinase 5
Synonyms:
CDK5 CDKN5 Cyclin-dependent kinase 5 (CDK5/ p25) Cyclin-dependent-like kinase 5 PSSALRE Tau protein kinase II catalytic subunit
Type:
Enzyme Subunit
Mol. Mass.:
33308.61
Organism:
Homo sapiens (Human)
Description:
Residue:
292
  
Component 2
Name:
Cyclin-dependent kinase 5 activator 1
Synonyms:
CD5R1_HUMAN CDK5R1 Cyclin-dependent kinase 5 (CDK5/p25) NCK5A p35
Type:
Enzyme Subunit
Mol. Mass.:
34077.43
Organism:
Homo sapiens (Human)
Description:
Q15078
Residue:
307
  
Inhibitor
Name:
BDBM50391200
Synonyms:
CHEMBL2088661
Type:
Small organic molecule
Emp. Form.:
C18H13BrN4O3
Mol. Mass.:
413.225
SMILES:
Cc1n[nH]c(=O)c2n(Cc3cccc(c3)[N+]([O-])=O)c3ccc(Br)cc3c12
: