Target
Delta-type opioid receptor
Ligand
BDBM50391603
Substrate
Meas. Tech.
ChEMBL_850392 (CHEMBL2150812)
Ki
0.151±n/a nM
Citation
 Ida, YMatsubara, ANemoto, TSaito, MHirayama, SFujii, HNagase, H Synthesis of quinolinomorphinan derivatives as highly selectived opioid receptor ligands. Bioorg Med Chem 20:5810-31 (2012)  
Target
Name:
Delta-type opioid receptor
Synonyms:
DOR-1 MSL-2 OPRD_MOUSE Oprd1
Type:
Enzyme Catalytic Domain
Mol. Mass.:
40577.25
Organism:
MOUSE
Description:
P32300
Residue:
372
  
Inhibitor
Name:
BDBM50391603
Synonyms:
CHEMBL2147916
Type:
Small organic molecule
Emp. Form.:
C25H26N2O3
Mol. Mass.:
402.4855
SMILES:
COc1cccc2nc3C[C@]45CCN(C)[C@H](Cc6ccc(O)cc46)[C@]5(O)Cc3cc12
: