Target
Receptor-type tyrosine-protein kinase FLT3
Ligand
BDBM50392791
Substrate
Meas. Tech.
ChEMBL_853154 (CHEMBL2154703)
IC50
2.1±n/a nM
Citation
 Wang, TLamb, MLBlock, MHDavies, AMHan, YHoffmann, EIoannidis, SJosey, JALiu, ZYLyne, PDMacIntyre, TMohr, PJOmer, CASjögren, TThress, KWang, BWang, HYu, DZhang, HJ Discovery of Disubstituted Imidazo[4,5-b]pyridines and Purines as Potent TrkA Inhibitors. ACS Med Chem Lett 3:705-709 (2012)  
Target
Name:
Receptor-type tyrosine-protein kinase FLT3
Synonyms:
CD135 FL cytokine receptor FLK2 FLT3 Fetal liver kinase-2 Fms-like tyrosine kinase 3 (Flt-3) STK-1 Stem cell tyrosine kinase 1
Type:
Enzyme
Mol. Mass.:
112888.62
Organism:
Homo sapiens (Human)
Description:
P36888
Residue:
993
  
Inhibitor
Name:
BDBM50392791
Synonyms:
CHEMBL2151321 | US8486966, 1
Type:
Small organic molecule
Emp. Form.:
C19H20FN7O
Mol. Mass.:
381.4068
SMILES:
CC(C)Oc1cc(n[nH]1)-n1cnc2ccc(N[C@@H](C)c3ccc(F)cn3)nc12
: