Target
Matrix metalloproteinase-9
Ligand
BDBM50393207
Substrate
Meas. Tech.
ChEMBL_850717 (CHEMBL2155986)
Ki
148000±n/a nM
Citation
 Mucha, AKafarski, PBerlicki, L Remarkable potential of thea-aminophosphonate/phosphinate structural motif in medicinal chemistry. J Med Chem 54:5955-80 (2011)  
Target
Name:
Matrix metalloproteinase-9
Synonyms:
67 kDa matrix metalloproteinase-9 92 kDa gelatinase CLG4B Gelatinase B MMP9 Matrix metalloproteinase 9 (MMP-9) Matrix metalloproteinase-9 (MMP9)
Type:
Enzyme
Mol. Mass.:
78452.28
Organism:
Homo sapiens (Human)
Description:
P14780
Residue:
707
  
Inhibitor
Name:
BDBM50393207
Synonyms:
CHEMBL2153738
Type:
Small organic molecule
Emp. Form.:
C37H36F3N4O7PS
Mol. Mass.:
768.738
SMILES:
NC(=O)[C@H](Cc1c[nH]c2ccccc12)NC(=O)[C@@H](CP(O)(=O)[C@H](Cc1ccccc1)NC(=O)OCc1ccccc1)Sc1ccccc1OC(F)(F)F
: