Target
Matrix metalloproteinase-14
Ligand
BDBM50393207
Substrate
Meas. Tech.
ChEMBL_850715 (CHEMBL2155984)
Ki
30000±n/a nM
Citation
 Mucha, AKafarski, PBerlicki, L Remarkable potential of thea-aminophosphonate/phosphinate structural motif in medicinal chemistry. J Med Chem 54:5955-80 (2011)  
Target
Name:
Matrix metalloproteinase-14
Synonyms:
MMP-14 MMP14 MT-MMP 1 MT1MMP Matrix Metalloproteinase-14 (MMP-14) Matrix metalloproteinase-14 Membrane-type matrix metalloproteinase 1 | Membrane-type-1 matrix metalloproteinase
Type:
Protein
Mol. Mass.:
65900.19
Organism:
Homo sapiens (Human)
Description:
P50281
Residue:
582
  
Inhibitor
Name:
BDBM50393207
Synonyms:
CHEMBL2153738
Type:
Small organic molecule
Emp. Form.:
C37H36F3N4O7PS
Mol. Mass.:
768.738
SMILES:
NC(=O)[C@H](Cc1c[nH]c2ccccc12)NC(=O)[C@@H](CP(O)(=O)[C@H](Cc1ccccc1)NC(=O)OCc1ccccc1)Sc1ccccc1OC(F)(F)F
: