Target
Matrilysin
Ligand
BDBM50393207
Substrate
Meas. Tech.
ChEMBL_850713 (CHEMBL2155982)
Ki
>200±n/a nM
Citation
 Mucha, AKafarski, PBerlicki, L Remarkable potential of thea-aminophosphonate/phosphinate structural motif in medicinal chemistry. J Med Chem 54:5955-80 (2011)  
Target
Name:
Matrilysin
Synonyms:
MMP7 MPSL1 Matrix metalloproteinase-7 (MMP-7) PUMP1
Type:
Enzyme
Mol. Mass.:
29681.54
Organism:
Homo sapiens (Human)
Description:
P09237
Residue:
267
  
Inhibitor
Name:
BDBM50393207
Synonyms:
CHEMBL2153738
Type:
Small organic molecule
Emp. Form.:
C37H36F3N4O7PS
Mol. Mass.:
768.738
SMILES:
NC(=O)[C@H](Cc1c[nH]c2ccccc12)NC(=O)[C@@H](CP(O)(=O)[C@H](Cc1ccccc1)NC(=O)OCc1ccccc1)Sc1ccccc1OC(F)(F)F
: