Target
Protein kinase C theta type
Ligand
BDBM50393218
Substrate
Meas. Tech.
ChEMBL_850747 (CHEMBL2156016)
IC50
0.500000±n/a nM
Citation
 Wagner, Jvon Matt, PFaller, BCooke, NGAlbert, RSedrani, RWiegand, HJean, CBeerli, CWeckbecker, GEvenou, JPZenke, GCottens, S Structure-activity relationship and pharmacokinetic studies of sotrastaurin (AEB071), a promising novel medicine for prevention of graft rejection and treatment of psoriasis. J Med Chem 54:6028-39 (2011)  
Target
Name:
Protein kinase C theta type
Synonyms:
KPCT_HUMAN PRKCT Protein kinase C theta type (PRKCQ) nPKC-theta
Type:
Serine/threonine-protein kinase
Mol. Mass.:
81878.04
Organism:
Homo sapiens (Human)
Description:
Full-length human PKC theta (Panvera Catalog No. P2996).
Residue:
706
  
Inhibitor
Name:
BDBM50393218
Synonyms:
CHEMBL1996510
Type:
Small organic molecule
Emp. Form.:
C24H20N6O2
Mol. Mass.:
424.4546
SMILES:
O=C1NC(=O)C(=C1c1c[nH]c2ccccc12)c1nc(nc2ccccc12)N1CCNCC1
: