Target
5-hydroxytryptamine receptor 3A
Ligand
BDBM50248045
Substrate
Meas. Tech.
ChEMBL_851152 (CHEMBL2157809)
Kd
13000±n/a nM
Citation
 Mazurov, AASpeake, JDYohannes, D Discovery and development ofa7 nicotinic acetylcholine receptor modulators. J Med Chem 54:7943-61 (2011)  
Target
Name:
5-hydroxytryptamine receptor 3A
Synonyms:
5-HT-3 5-HT3A 5-hydroxytryptamine receptor 3 (5-HT3) 5-hydroxytryptamine receptor 3A (5HT3A) 5HT3R HTR3A Serotonin 3 receptor (5HT3) Serotonin-gated ion channel receptor | Serotonin-gated ion channel receptor 3
Type:
Protein
Mol. Mass.:
55283.27
Organism:
Homo sapiens (Human)
Description:
P46098
Residue:
478
  
Inhibitor
Name:
BDBM50248045
Synonyms:
(S)-1-(2-fluorophenyl)ethyl (S)-quinuclidin-3-ylcarbamate | CHEMBL499536
Type:
Small organic molecule
Emp. Form.:
C16H21FN2O2
Mol. Mass.:
292.3485
SMILES:
C[C@H](OC(=O)N[C@@H]1CN2CCC1CC2)c1ccccc1F
: