Target
Delta-type opioid receptor
Ligand
BDBM50395059
Substrate
Meas. Tech.
ChEMBL_859250 (CHEMBL2166335)
IC50
10±n/a nM
Citation
 Wang, YXing, YLiu, XJi, HKai, MChen, ZYu, JZhao, DRen, HWang, R A new class of highly potent and selective endomorphin-1 analogues containinga-methylene-ß-aminopropanoic acids (map). J Med Chem 55:6224-36 (2012)  
Target
Name:
Delta-type opioid receptor
Synonyms:
DOR-1 MSL-2 OPRD_MOUSE Oprd1
Type:
Enzyme Catalytic Domain
Mol. Mass.:
40577.25
Organism:
MOUSE
Description:
P32300
Residue:
372
  
Inhibitor
Name:
BDBM50395059
Synonyms:
CHEMBL2163917
Type:
Small organic molecule
Emp. Form.:
C33H36N6O6
Mol. Mass.:
612.6755
SMILES:
N[C@@H](Cc1ccc(O)cc1)C(=O)N1CCC[C@H]1C(=O)N[C@@H](Cc1c[nH]c2ccccc12)C(=O)N[C@H](C(=C)C(N)=O)c1ccoc1
: