Target
Adenosine receptor A1
Ligand
BDBM50395127
Substrate
Meas. Tech.
ChEMBL_859788 (CHEMBL2169616)
EC50
5400±n/a nM
Citation
 Korboukh, IHull-Ryde, EARittiner, JERandhawa, ASColeman, JFitzpatrick, BJSetola, VJanzen, WPFrye, SVZylka, MJJin, J Orally active adenosine A(1) receptor agonists with antinociceptive effects in mice. J Med Chem 55:6467-77 (2012)  
Target
Name:
Adenosine receptor A1
Synonyms:
A1 adenosine receptor (hA1) AA1R_HUMAN ADORA1 Adenosine A1-receptor Adenosine receptor A1 (hA1) | Adenosine transporter (AdT)
Type:
G Protein-Coupled Receptor (GPCR)
Mol. Mass.:
36520.92
Organism:
Homo sapiens (Human)
Description:
P30542
Residue:
326
  
Inhibitor
Name:
BDBM50395127
Synonyms:
CHEMBL2163567
Type:
Small organic molecule
Emp. Form.:
C21H27ClN5O8P
Mol. Mass.:
543.895
SMILES:
COP(=O)(OC)OCC(Cc1ccccc1)Nc1nc(Cl)nc2n(cnc12)[C@@H]1O[C@H](CO)[C@@H](O)[C@H]1O
: