Target
A disintegrin and metalloproteinase with thrombospondin motifs 4
Ligand
BDBM50168737
Substrate
Meas. Tech.
ChEMBL_860057 (CHEMBL2167993)
IC50
3±n/a nM
Citation
 Deng, HO'Keefe, HDavie, CPLind, KEAcharya, RAFranklin, GJLarkin, JMatico, RNeeb, MThompson, MMLohr, TGross, JWCentrella, PAO'Donovan, GKBedard, KLvan Vloten, KMataruse, SSkinner, SRBelyanskaya, SLCarpenter, TYShearer, TWClark, MACuozzo, JWArico-Muendel, CCMorgan, BA Discovery of highly potent and selective small molecule ADAMTS-5 inhibitors that inhibit human cartilage degradation via encoded library technology (ELT). J Med Chem 55:7061-79 (2012)  
Target
Name:
A disintegrin and metalloproteinase with thrombospondin motifs 4
Synonyms:
A disintegrin and metalloproteinase with thrombospondin motifs 4 (ADAMTS-4) ATS4_HUMAN KIAA0688 | Metalloproteinase with thrombospondin motifs 4 (ADAMTS-4)
Type:
Enzyme
Mol. Mass.:
90214.54
Organism:
Homo sapiens (Human)
Description:
O75173
Residue:
837
  
Inhibitor
Name:
BDBM50168737
Synonyms:
(2R,3R)-1-[4-(2-Chloro-4-fluoro-benzyloxy)-benzenesulfonyl]-3-hydroxy-3-methyl-piperidine-2-carboxylic acid hydroxyamide | CHEMBL187092
Type:
Small organic molecule
Emp. Form.:
C20H22ClFN2O6S
Mol. Mass.:
472.915
SMILES:
C[C@@]1(O)CCCN([C@H]1C(=O)NO)S(=O)(=O)c1ccc(OCc2ccc(F)cc2Cl)cc1
: