Target
UDP-3-O-acyl-N-acetylglucosamine deacetylase
Ligand
BDBM50395900
Substrate
Meas. Tech.
ChEMBL_858075 (CHEMBL2166987)
IC50
6.75±n/a nM
Citation
 McAllister, LAMontgomery, JIAbramite, JAReilly, UBrown, MFChen, JMBarham, RAChe, YChung, SWMenard, CAMitton-Fry, MMullins, LMNoe, MCO'Donnell, JPOliver, RMPenzien, JBPlummer, MPrice, LMShanmugasundaram, VTomaras, APUccello, DP Heterocyclic methylsulfone hydroxamic acid LpxC inhibitors as Gram-negative antibacterial agents. Bioorg Med Chem Lett 22:6832-8 (2012)  
Target
Name:
UDP-3-O-acyl-N-acetylglucosamine deacetylase
Synonyms:
lpxC
Type:
PROTEIN
Mol. Mass.:
21890.40
Organism:
Pseudomonas aeruginosa
Description:
ChEMBL_858075
Residue:
197
  
Inhibitor
Name:
BDBM50395900
Synonyms:
CHEMBL2164189
Type:
Small organic molecule
Emp. Form.:
C15H17FN2O5S
Mol. Mass.:
356.369
SMILES:
CC(CCc1cc(on1)-c1cccc(F)c1)(C(=O)NO)S(C)(=O)=O
: