Target
Histone-lysine N-methyltransferase EHMT2
Ligand
BDBM50300028
Substrate
Meas. Tech.
ChEMBL_861229 (CHEMBL2173367)
IC50
1900±n/a nM
Citation
 Decarlo, DHadden, MK Oncoepigenomics: making histone lysine methylation count. Eur J Med Chem 56:179-194 (2012)  
Target
Name:
Histone-lysine N-methyltransferase EHMT2
Synonyms:
BAT8 EHMT2 G9A Histone-lysine N-methyltransferase EHMT1/EHMT2 KMT1C Protein G9a (G9a)
Type:
Enzyme
Mol. Mass.:
132339.87
Organism:
Homo sapiens (Human)
Description:
Q96KQ7
Residue:
1210
  
Inhibitor
Name:
BDBM50300028
Synonyms:
CHEMBL569864 | N-(1-benzylpiperidin-4-yl)-6,7-dimethoxy-2-(4-methyl-1,4-diazepan-1-yl)quinazolin-4-amine
Type:
Small organic molecule
Emp. Form.:
C28H38N6O2
Mol. Mass.:
490.6403
SMILES:
COc1cc2nc(nc(NC3CCN(Cc4ccccc4)CC3)c2cc1OC)N1CCCN(C)CC1
: