Target
Histone-lysine N-methyltransferase EHMT2
Ligand
BDBM50134315
Substrate
Meas. Tech.
ChEMBL_861233 (CHEMBL2173371)
IC50
530±n/a nM
Citation
 Decarlo, DHadden, MK Oncoepigenomics: making histone lysine methylation count. Eur J Med Chem 56:179-194 (2012)  
Target
Name:
Histone-lysine N-methyltransferase EHMT2
Synonyms:
BAT8 EHMT2 G9A Histone-lysine N-methyltransferase EHMT1/EHMT2 KMT1C Protein G9a (G9a)
Type:
Enzyme
Mol. Mass.:
132339.87
Organism:
Homo sapiens (Human)
Description:
Q96KQ7
Residue:
1210
  
Inhibitor
Name:
BDBM50134315
Synonyms:
7-hydroxy-11-hydroxymethyl-12-methyl-14,15-dithia-9,12-diazatetracyclo[9.2.2.01,9.03,8]pentadeca-3,5-diene-10,13-dione GLIOTOXIN
Type:
Small organic molecule
Emp. Form.:
C13H14N2O4S2
Mol. Mass.:
326.391
SMILES:
CN1C(=O)[C@]23CC4=CC=C[C@H](O)[C@H]4N2C(=O)[C@@]1(CO)SS3
: