Target
Tyrosine-protein kinase SYK
Ligand
BDBM50126439
Substrate
Meas. Tech.
ChEMBL_861815 (CHEMBL2173408)
IC50
490±n/a nM
Citation
 Singh, RMasuda, ESPayan, DG Discovery and development of spleen tyrosine kinase (SYK) inhibitors. J Med Chem 55:3614-43 (2012)  
Target
Name:
Tyrosine-protein kinase SYK
Synonyms:
KSYK_HUMAN Spleen Tyrosine Kinase Tyrosine-protein kinase SYK (Syk)
Type:
Enzyme
Mol. Mass.:
72079.99
Organism:
Homo sapiens (Human)
Description:
P43405
Residue:
635
  
Inhibitor
Name:
BDBM50126439
Synonyms:
CHEMBL30774 | [7-(4-Methoxy-phenyl)-[1,6]naphthyridin-5-yl]-methyl-amine
Type:
Small organic molecule
Emp. Form.:
C16H15N3O
Mol. Mass.:
265.3098
SMILES:
CNc1nc(cc2ncccc12)-c1ccc(OC)cc1
: