Target
Tyrosine-protein kinase SYK
Ligand
BDBM50132442
Substrate
Meas. Tech.
ChEMBL_861815 (CHEMBL2173408)
IC50
8100±n/a nM
Citation
 Singh, RMasuda, ESPayan, DG Discovery and development of spleen tyrosine kinase (SYK) inhibitors. J Med Chem 55:3614-43 (2012)  
Target
Name:
Tyrosine-protein kinase SYK
Synonyms:
KSYK_HUMAN Spleen Tyrosine Kinase Tyrosine-protein kinase SYK (Syk)
Type:
Enzyme
Mol. Mass.:
72079.99
Organism:
Homo sapiens (Human)
Description:
P43405
Residue:
635
  
Inhibitor
Name:
BDBM50132442
Synonyms:
3-(5-Methoxy-1-methyl-1H-indol-3-ylmethyl)-2-oxo-2,3-dihydro-1H-indole-5-sulfonic acid amide | CHEMBL105421
Type:
Small organic molecule
Emp. Form.:
C19H19N3O4S
Mol. Mass.:
385.437
SMILES:
COc1ccc2n(C)cc(CC3C(=O)Nc4ccc(cc34)S(N)(=O)=O)c2c1
: