Target
Aldo-keto reductase family 1 member C3
Ligand
BDBM50396657
Substrate
Meas. Tech.
ChEMBL_864139 (CHEMBL2174987)
IC50
20±n/a nM
Citation
 Jamieson, SMBrooke, DGHeinrich, DAtwell, GJSilva, SHamilton, EJTurnbull, APRigoreau, LJTrivier, ESoudy, CSamlal, SSOwen, PJSchroeder, ERaynham, TFlanagan, JUDenny, WA 3-(3,4-Dihydroisoquinolin-2(1H)-ylsulfonyl)benzoic Acids: highly potent and selective inhibitors of the type 5 17-ß-hydroxysteroid dehydrogenase AKR1C3. J Med Chem 55:7746-58 (2012)  
Target
Name:
Aldo-keto reductase family 1 member C3
Synonyms:
17-beta-Hydroxysteroid Dehydrogenase 5 (17-beta-HSD5, AKR1C3) AK1C3_HUMAN Aldo-keto reductase family 1 member C3 Aldo-keto reductase family 1 member C3 (AK1C3a) Aldo-keto-reductase family 1 member C3 Dihydrodiol dehydrogenase 3 Estradiol 17-beta-dehydrogenase KIAA0119 Prostaglandin F synthase Trans-1,2-dihydrobenzene-1,2-diol dehydrogenase
Type:
Enzyme
Mol. Mass.:
36859.86
Organism:
Homo sapiens (Human)
Description:
P42330
Residue:
323
  
Inhibitor
Name:
BDBM50396657
Synonyms:
CHEMBL2172115
Type:
Small organic molecule
Emp. Form.:
C16H14INO4S
Mol. Mass.:
443.256
SMILES:
OC(=O)c1cccc(c1)S(=O)(=O)N1CCc2c(I)cccc2C1
: