Target
Cytochrome P450 2C8
Ligand
BDBM50397663
Substrate
Meas. Tech.
ChEMBL_873351 (CHEMBL2185204)
Ki
20000±n/a nM
Citation
 Orr, STRipp, SLBallard, TEHenderson, JLScott, DOObach, RSSun, HKalgutkar, AS Mechanism-based inactivation (MBI) of cytochrome P450 enzymes: structure-activity relationships and discovery strategies to mitigate drug-drug interaction risks. J Med Chem 55:4896-933 (2012)  
Target
Name:
Cytochrome P450 2C8
Synonyms:
CP2C8_HUMAN CYPIIC8 P450 IIC2 P450 form 1 | S-mephenytoin 4-hydroxylase
Type:
Protein
Mol. Mass.:
55839.23
Organism:
Homo sapiens (Human)
Description:
P10632
Residue:
490
  
Inhibitor
Name:
BDBM50397663
Synonyms:
CHEMBL2181817
Type:
Small organic molecule
Emp. Form.:
C21H30O9
Mol. Mass.:
426.4575
SMILES:
Cc1ccc(C)c(OCCCC(C)(C)C(=O)O[C@@H]2O[C@@H]([C@@H](O)[C@H](O)[C@H]2O)C(O)=O)c1
: