Target
Adenosine receptor A3
Ligand
BDBM50053924
Substrate
Meas. Tech.
ChEMBL_874127 (CHEMBL2187068)
Ki
561±n/a nM
Citation
 Baraldi, PGPreti, DBorea, PAVarani, K Medicinal chemistry of A3 adenosine receptor modulators: pharmacological activities and therapeutic implications. J Med Chem 55:5676-703 (2012)  
Target
Name:
Adenosine receptor A3
Synonyms:
A3 adenosine receptor (hA3) ADORA3 | Adenosine A3 receptor (A3AR)
Type:
G Protein-Coupled Receptor (GPCR)
Mol. Mass.:
36197.32
Organism:
Homo sapiens (Human)
Description:
P0DMS8
Residue:
318
  
Inhibitor
Name:
BDBM50053924
Synonyms:
3,6-Dichloro-2-(2-isopropoxy-4-methyl-phenyl)-chromen-4-one MRS1067
Type:
Small organic molecule
Emp. Form.:
C19H16Cl2O3
Mol. Mass.:
363.235
SMILES:
CC(C)Oc1cc(C)ccc1-c1oc2ccc(Cl)cc2c(=O)c1Cl
: