Target
Adenosine receptor A1
Ligand
BDBM50067116
Substrate
Meas. Tech.
ChEMBL_874130 (CHEMBL2187071)
Ki
>10000±n/a nM
Citation
 Baraldi, PGPreti, DBorea, PAVarani, K Medicinal chemistry of A3 adenosine receptor modulators: pharmacological activities and therapeutic implications. J Med Chem 55:5676-703 (2012)  
Target
Name:
Adenosine receptor A1
Synonyms:
AA1R_RAT ADENOSINE A1 high Adenosine A1 receptor (A1) Adenosine receptors A1 | Adora1
Type:
Protein
Mol. Mass.:
36704.13
Organism:
Rattus norvegicus (rat)
Description:
Residue:
326
  
Inhibitor
Name:
BDBM50067116
Synonyms:
4-Methoxy-N-(3-pyridin-2-yl-isoquinolin-1-yl)-benzamide CHEMBL128929 | VUF-8504
Type:
Small organic molecule
Emp. Form.:
C22H17N3O2
Mol. Mass.:
355.3893
SMILES:
COc1ccc(cc1)C(=O)Nc1nc(cc2ccccc12)-c1ccccn1
: