Target
DNA-dependent protein kinase catalytic subunit
Ligand
BDBM50319926
Substrate
Meas. Tech.
ChEMBL_873192 (CHEMBL2183423)
IC50
5±n/a nM
Citation
 Finlay, MRGriffin, RJ Modulation of DNA repair by pharmacological inhibitors of the PIKK protein kinase family. Bioorg Med Chem Lett 22:5352-9 (2012)  
Target
Name:
DNA-dependent protein kinase catalytic subunit
Synonyms:
DNA-PK catalytic subunit DNA-dependent protein kinase (DNA-PK) DNA-dependent protein kinase catalytic subunit (DNA-PK) HYRC PRKDC | PRKDC_HUMAN
Type:
Protein
Mol. Mass.:
469114.78
Organism:
Homo sapiens (Human)
Description:
P78527
Residue:
4128
  
Inhibitor
Name:
BDBM50319926
Synonyms:
2-(4-ethylpiperazin-1-yl)-N-(4-(2-morpholino-4-oxo-4H-chromen-8-yl)dibenzo[b,d]thiophen-1-yl)acetamide KU-0060648
Type:
Small organic molecule
Emp. Form.:
C33H34N4O4S
Mol. Mass.:
582.712
SMILES:
CCN1CCN(CC(=O)Nc2ccc(-c3cccc4c3oc(cc4=O)N3CCOCC3)c3sc4ccccc4c23)CC1
: