Target
Dual specificity tyrosine-phosphorylation-regulated kinase 1A
Ligand
BDBM50347750
Substrate
Meas. Tech.
ChEMBL_875427 (CHEMBL2182294)
IC50
10±n/a nM
Citation
 Tahtouh, TElkins, JMFilippakopoulos, PSoundararajan, MBurgy, GDurieu, ECochet, CSchmid, RSLo, DCDelhommel, FOberholzer, AEPearl, LHCarreaux, FBazureau, JPKnapp, SMeijer, L Selectivity, cocrystal structures, and neuroprotective properties of leucettines, a family of protein kinase inhibitors derived from the marine sponge alkaloid leucettamine B. J Med Chem 55:9312-30 (2012)  
Target
Name:
Dual specificity tyrosine-phosphorylation-regulated kinase 1A
Synonyms:
DYR1A_RAT Dual-specificity tyrosine-(Y)-phosphorylation regulated kinase 1A Dyrk1a
Type:
Enzyme Catalytic Domain
Mol. Mass.:
85573.59
Organism:
RAT
Description:
Dual-specificity tyrosine-(Y)-phosphorylation regulated kinase 1A 0 RAT::Q63470
Residue:
763
  
Inhibitor
Name:
BDBM50347750
Synonyms:
CHEMBL1802358
Type:
Small organic molecule
Emp. Form.:
C17H13N3O3
Mol. Mass.:
307.3034
SMILES:
O=C1NC(Nc2ccccc2)=NC1=Cc1ccc2OCOc2c1
: