Target
Macrophage migration inhibitory factor
Ligand
BDBM50399050
Substrate
Meas. Tech.
ChEMBL_878773 (CHEMBL2183713)
Ki
7700±n/a nM
Citation
 Dahlgren, MKGarcia, ABHare, AATirado-Rives, JLeng, LBucala, RJorgensen, WL Virtual screening and optimization yield low-nanomolar inhibitors of the tautomerase activity of Plasmodium falciparum macrophage migration inhibitory factor. J Med Chem 55:10148-59 (2012)  
Target
Name:
Macrophage migration inhibitory factor
Synonyms:
Macrophage migration inhibitory factor (MIF)
Type:
Enzyme
Mol. Mass.:
12844.38
Organism:
Plasmodium falciparum
Description:
Q6Q3H7
Residue:
116
  
Inhibitor
Name:
BDBM50399050
Synonyms:
CHEMBL2178857
Type:
Small organic molecule
Emp. Form.:
C19H17NO2
Mol. Mass.:
291.3438
SMILES:
COc1cccc(Oc2cc(C)nc(c2)-c2ccccc2)c1
: