Target
Macrophage migration inhibitory factor
Ligand
BDBM50399057
Substrate
Meas. Tech.
ChEMBL_878773 (CHEMBL2183713)
Ki
7200±n/a nM
Citation
 Dahlgren, MKGarcia, ABHare, AATirado-Rives, JLeng, LBucala, RJorgensen, WL Virtual screening and optimization yield low-nanomolar inhibitors of the tautomerase activity of Plasmodium falciparum macrophage migration inhibitory factor. J Med Chem 55:10148-59 (2012)  
Target
Name:
Macrophage migration inhibitory factor
Synonyms:
Macrophage migration inhibitory factor (MIF)
Type:
Enzyme
Mol. Mass.:
12844.38
Organism:
Plasmodium falciparum
Description:
Q6Q3H7
Residue:
116
  
Inhibitor
Name:
BDBM50399057
Synonyms:
CHEMBL2178848
Type:
Small organic molecule
Emp. Form.:
C18H22N2O3
Mol. Mass.:
314.3789
SMILES:
CCOc1cccc(Oc2cc(C)nc(c2)N2CCOCC2)c1
: