Target
Macrophage migration inhibitory factor
Ligand
BDBM50399061
Substrate
Meas. Tech.
ChEMBL_878773 (CHEMBL2183713)
Ki
122000±n/a nM
Citation
 Dahlgren, MKGarcia, ABHare, AATirado-Rives, JLeng, LBucala, RJorgensen, WL Virtual screening and optimization yield low-nanomolar inhibitors of the tautomerase activity of Plasmodium falciparum macrophage migration inhibitory factor. J Med Chem 55:10148-59 (2012)  
Target
Name:
Macrophage migration inhibitory factor
Synonyms:
Macrophage migration inhibitory factor (MIF)
Type:
Enzyme
Mol. Mass.:
12844.38
Organism:
Plasmodium falciparum
Description:
Q6Q3H7
Residue:
116
  
Inhibitor
Name:
BDBM50399061
Synonyms:
CHEMBL2178844
Type:
Small organic molecule
Emp. Form.:
C17H20N2O4
Mol. Mass.:
316.3517
SMILES:
COc1cc(OC)cc(Oc2ccnc(c2)N2CCOCC2)c1
: