Target
Macrophage migration inhibitory factor
Ligand
BDBM50399063
Substrate
Meas. Tech.
ChEMBL_878773 (CHEMBL2183713)
Ki
57200±n/a nM
Citation
 Dahlgren, MKGarcia, ABHare, AATirado-Rives, JLeng, LBucala, RJorgensen, WL Virtual screening and optimization yield low-nanomolar inhibitors of the tautomerase activity of Plasmodium falciparum macrophage migration inhibitory factor. J Med Chem 55:10148-59 (2012)  
Target
Name:
Macrophage migration inhibitory factor
Synonyms:
Macrophage migration inhibitory factor (MIF)
Type:
Enzyme
Mol. Mass.:
12844.38
Organism:
Plasmodium falciparum
Description:
Q6Q3H7
Residue:
116
  
Inhibitor
Name:
BDBM50399063
Synonyms:
CHEMBL2178841
Type:
Small organic molecule
Emp. Form.:
C19H17NO3
Mol. Mass.:
307.3432
SMILES:
COc1cccc(Oc2ccc(nc2)-c2cccc(OC)c2)c1
: