Target
Lysosomal acid glucosylceramidase
Ligand
BDBM18351
Substrate
Meas. Tech.
ChEMBL_878843 (CHEMBL2184151)
IC50
210000±n/a nM
Citation
 Kato, AHayashi, EMiyauchi, SAdachi, IImahori, TNatori, YYoshimura, YNash, RJShimaoka, HNakagome, IKoseki, JHirono, STakahata, H a-1-C-butyl-1,4-dideoxy-1,4-imino-l-arabinitol as a second-generation iminosugar-based orala-glucosidase inhibitor for improving postprandial hyperglycemia. J Med Chem 55:10347-62 (2012)  
Target
Name:
Lysosomal acid glucosylceramidase
Synonyms:
Acid beta-glucosidase GBA GBA1_BOVIN | Glucosylceramidase
Type:
PROTEIN
Mol. Mass.:
59862.93
Organism:
Bos taurus
Description:
ChEMBL_1460504
Residue:
536
  
Inhibitor
Name:
BDBM18351
Synonyms:
(2R,3R,4R,5S)-2-(Hydroxymethyl)piperidine-3,4,5-triol, 10 1-Deoxynojirimycin CHEMBL307429 US9181184, 1 | dNM
Type:
natural product
Emp. Form.:
C6H13NO4
Mol. Mass.:
163.1717
SMILES:
OC[C@H]1NC[C@H](O)[C@@H](O)[C@@H]1O
: