Target
Macrophage colony-stimulating factor 1 receptor
Ligand
BDBM50400602
Substrate
Meas. Tech.
ChEMBL_880062 (CHEMBL2213411)
IC50
10.5±n/a nM
Citation
 Liu, GCampbell, BTHolladay, MWFord Pulido, JMHua, HGitnick, DGardner, MFJames, JBreider, MABrigham, DBelli, BArmstrong, RCTreiber, DK Discovery of AC710, a Globally Selective Inhibitor of Platelet-Derived Growth Factor Receptor-Family Kinases. ACS Med Chem Lett 3:997-1002 (2012)  
Target
Name:
Macrophage colony-stimulating factor 1 receptor
Synonyms:
CSF1R FMS Macrophage colony stimulating factor receptor Macrophage colony-stimulating factor 1 receptor (c-FMS) Proto-oncogene c-Fms c-fms | cFMS
Type:
Protein
Mol. Mass.:
107979.48
Organism:
Homo sapiens (Human)
Description:
P07333
Residue:
972
  
Inhibitor
Name:
BDBM50400602
Synonyms:
CHEMBL2206278
Type:
Small organic molecule
Emp. Form.:
C31H42N6O4
Mol. Mass.:
562.703
SMILES:
CCN1C(C)(C)CC(CC1(C)C)Oc1ccc(nc1)C(=O)Nc1ccc(NC(=O)Nc2cc(on2)C(C)(C)C)cc1
: