Target
Microtubule-associated protein tau
Ligand
BDBM50400616
Substrate
Meas. Tech.
ChEMBL_880071 (CHEMBL2213420)
Kd
0.7±n/a nM
Citation
 Shao, XCarpenter, GMDesmond, TJSherman, PQuesada, CAFawaz, MBrooks, AFKilbourn, MRAlbin, RLFrey, KAScott, PJ Evaluation of [(11)C]N-Methyl Lansoprazole as a Radiopharmaceutical for PET Imaging of Tau Neurofibrillary Tangles. ACS Med Chem Lett 3:936-941 (2012)  
Target
Name:
Microtubule-associated protein tau
Synonyms:
MAPT MTBT1 Neurofibrillary tangle protein Paired helical filament-tau TAU_HUMAN | Tau Protein
Type:
Protein
Mol. Mass.:
78928.63
Organism:
Homo sapiens (Human)
Description:
P10636
Residue:
758
  
Inhibitor
Name:
BDBM50400616
Synonyms:
CHEMBL2203439
Type:
Small organic molecule
Emp. Form.:
C17H16F3N3O2S
Mol. Mass.:
383.388
SMILES:
Cc1c(OCC(F)(F)F)ccnc1CS(=O)c1nc2ccccc2n1C
: