Target
Apoptosis regulator Bcl-2
Ligand
BDBM50060993
Substrate
Meas. Tech.
ChEMBL_879299 (CHEMBL2208697)
IC50
300000±n/a nM
Citation
 Meanwell, NA Synopsis of some recent tactical application of bioisosteres in drug design. J Med Chem 54:2529-91 (2011)  
Target
Name:
Apoptosis regulator Bcl-2
Synonyms:
Apoptosis regulator Bcl-2 Protein BCL-2 BCL2_HUMAN | Bcl-2 Protein
Type:
Homodimer or heterodimer
Mol. Mass.:
26269.11
Organism:
Homo sapiens (Human)
Description:
P10415
Residue:
239
  
Inhibitor
Name:
BDBM50060993
Synonyms:
4'-FLUORO-1,1'-BIPHENYL-4-CARBOXYLIC ACID CHEMBL106708
Type:
Small organic molecule
Emp. Form.:
C13H9FO2
Mol. Mass.:
216.2078
SMILES:
OC(=O)c1ccc(cc1)-c1ccc(F)cc1
: