Target
D(2) dopamine receptor
Ligand
BDBM50400823
Substrate
Meas. Tech.
ChEMBL_879323 (CHEMBL2208721)
Ki
0.55±n/a nM
Citation
 Meanwell, NA Synopsis of some recent tactical application of bioisosteres in drug design. J Med Chem 54:2529-91 (2011)  
Target
Name:
D(2) dopamine receptor
Synonyms:
D(2) dopamine receptor DOPAMINE D2 Long DRD2 Dopamine D2 receptor Dopamine D2 receptor (D2R) Dopamine2-like | d2
Type:
Cell-surface receptors
Mol. Mass.:
50647.10
Organism:
Homo sapiens (Human)
Description:
P14416
Residue:
443
  
Inhibitor
Name:
BDBM50400823
Synonyms:
CHEMBL2204343
Type:
Small organic molecule
Emp. Form.:
C20H23ClFNO2Si
Mol. Mass.:
391.939
SMILES:
O[Si]1(CCN(CCCC(=O)c2ccc(F)cc2)CC1)c1ccc(Cl)cc1
: