Target
Sodium-dependent dopamine transporter
Ligand
BDBM50400824
Substrate
Meas. Tech.
ChEMBL_879331 (CHEMBL2208729)
IC50
36350±n/a nM
Citation
 Meanwell, NA Synopsis of some recent tactical application of bioisosteres in drug design. J Med Chem 54:2529-91 (2011)  
Target
Name:
Sodium-dependent dopamine transporter
Synonyms:
DA transporter DAT1 Dopamine transporter protein (DAT) SC6A3_HUMAN Sodium-dependent dopamine transporter Solute carrier family 6 member 3
Type:
Multi-pass membrane protein
Mol. Mass.:
68497.11
Organism:
Homo sapiens (Human)
Description:
Q01959
Residue:
620
  
Inhibitor
Name:
BDBM50400824
Synonyms:
CHEMBL2204342
Type:
Small organic molecule
Emp. Form.:
C16H27NO2Si
Mol. Mass.:
293.4766
SMILES:
COc1ccc(cc1)[C@@H](CN(C)C)[Si]1(O)CCCCC1
: