Target
Epidermal growth factor receptor
Ligand
BDBM50400825
Substrate
Meas. Tech.
ChEMBL_879290 (CHEMBL2208688)
IC50
>40000±n/a nM
Citation
 Meanwell, NA Synopsis of some recent tactical application of bioisosteres in drug design. J Med Chem 54:2529-91 (2011)  
Target
Name:
Epidermal growth factor receptor
Synonyms:
EGF Receptor Substrate EGFR_HUMAN ERBB1 Epidermal Growth Factor Receptor erbB-1 Epidermal growth factor receptor (EGFR) HER1 Proto-oncogene c-ErbB-1 Tyrosine-Protein Kinase ErbB-1
Type:
Receptor Kinase Domain
Mol. Mass.:
134279.59
Organism:
Homo sapiens (Human)
Description:
P00533
Residue:
1210
  
Inhibitor
Name:
BDBM50400825
Synonyms:
CHEMBL2205027
Type:
Small organic molecule
Emp. Form.:
C13H11BrN2O4S3
Mol. Mass.:
435.336
SMILES:
CS(=O)(=O)Nc1ccc2c(c1)S(=O)(=O)N=S2c1ccc(Br)cc1
: