Target
Fatty-acid amide hydrolase 1
Ligand
BDBM50204512
Substrate
Meas. Tech.
ChEMBL_879293 (CHEMBL2208691)
Ki
0.4±n/a nM
Citation
 Meanwell, NA Synopsis of some recent tactical application of bioisosteres in drug design. J Med Chem 54:2529-91 (2011)  
Target
Name:
Fatty-acid amide hydrolase 1
Synonyms:
Anandamide amidohydrolase FAAH FAAH1_HUMAN Fatty-acid amide hydrolase (FAAH) Oleamide hydrolase 1
Type:
Protein
Mol. Mass.:
63071.19
Organism:
Homo sapiens (Human)
Description:
O00519
Residue:
579
  
Inhibitor
Name:
BDBM50204512
Synonyms:
2-(7-phenylheptanoyl)oxazole-5-carbonitrile | CHEMBL220770
Type:
Small organic molecule
Emp. Form.:
C17H18N2O2
Mol. Mass.:
282.337
SMILES:
O=C(CCCCCCc1ccccc1)c1ncc(o1)C#N
: