Target
B1 bradykinin receptor
Ligand
BDBM50182456
Substrate
Meas. Tech.
ChEMBL_879298 (CHEMBL2208696)
Ki
63±n/a nM
Citation
 Meanwell, NA Synopsis of some recent tactical application of bioisosteres in drug design. J Med Chem 54:2529-91 (2011)  
Target
Name:
B1 bradykinin receptor
Synonyms:
B1 BRADYKININ B1R BK-1 receptor BRADYB1 | Bradykinin B1 receptor
Type:
Enzyme
Mol. Mass.:
40508.87
Organism:
Homo sapiens (Human)
Description:
P46663
Residue:
353
  
Inhibitor
Name:
BDBM50182456
Synonyms:
CHEMBL202089 | methyl 4'-{[({1-[(3,3,3-trifluoropropanoyl)amino]cyclopropyl}carbonyl)amino]methyl}-1,1'-biphenyl-2-carboxylate
Type:
Small organic molecule
Emp. Form.:
C22H21F3N2O4
Mol. Mass.:
434.4083
SMILES:
COC(=O)c1ccccc1-c1ccc(CNC(=O)C2(CC2)NC(=O)CC(F)(F)F)cc1
: