Target
Substance-P receptor
Ligand
BDBM50299467
Substrate
Meas. Tech.
ChEMBL_883639 (CHEMBL2210304)
Ki
>10000±n/a nM
Citation
 Bissantz, CBohnert, CHoffmann, TMarcuz, ASchnider, PMalherbe, P Identification of a crucial amino acid in the helix position 6.51 of human tachykinin neurokinin 1 and 3 receptors contributing to the insurmountable mode of antagonism by dual NK1/NK3 antagonists. J Med Chem 55:5061-76 (2012)  
Target
Name:
Substance-P receptor
Synonyms:
NK-1 receptor NK1 Receptor NK1R_HUMAN Neurokinin-1 (NK-1) SPR TACR1 Tachykinin receptor 1 (NK1) | tachykinin
Type:
G Protein-Coupled Receptor (GPCR)
Mol. Mass.:
46254.43
Organism:
Homo sapiens (Human)
Description:
P25103
Residue:
407
  
Inhibitor
Name:
BDBM50299467
Synonyms:
(5S,8S,14S,17S,20S,23S,26S,29S,32S)-26-((1H-imidazol-5-yl)methyl)-32-amino-14,17,20-tribenzyl-5-carbamoyl-23-(carboxymethyl)-8-isobutyl-15-methyl-29-(2-(methylthio)ethyl)-7,10,13,16,19,22,25,28,31-nonaoxo-2-thia-6,9,12,15,18,21,24,27,30-nonaazatetratriacontan-34-oic acid | CHEMBL583102
Type:
Small organic molecule
Emp. Form.:
C60H81N13O14S2
Mol. Mass.:
1272.494
SMILES:
CSCC[C@H](NC(=O)[C@H](CC(C)C)NC(=O)CNC(=O)[C@H](Cc1ccccc1)N(C)C(=O)[C@H](Cc1ccccc1)NC(=O)[C@H](Cc1ccccc1)NC(=O)[C@H](CC(O)=O)NC(=O)[C@H](Cc1cnc[nH]1)NC(=O)[C@H](CCSC)NC(=O)[C@@H](N)CC(O)=O)C(N)=O
: