Target
Trace amine-associated receptor 1
Ligand
BDBM50064817
Substrate
Meas. Tech.
ChEMBL_882009 (CHEMBL2213071)
Ki
82±n/a nM
Citation
 Galley, GStalder, HGoergler, AHoener, MCNorcross, RD Optimisation of imidazole compounds as selective TAAR1 agonists: discovery of RO5073012. Bioorg Med Chem Lett 22:5244-8 (2012)  
Target
Name:
Trace amine-associated receptor 1
Synonyms:
TA1 TAAR1_HUMAN TRAR1 | trace amine-associated receptor 1
Type:
PROTEIN
Mol. Mass.:
39107.47
Organism:
Homo sapiens (Human)
Description:
ChEMBL_792734
Residue:
339
  
Inhibitor
Name:
BDBM50064817
Synonyms:
2-(2,6-Dimethyl-benzyl)-4,5-dihydro-1H-imidazole | CHEMBL71033
Type:
Small organic molecule
Emp. Form.:
C12H16N2
Mol. Mass.:
188.2688
SMILES:
Cc1cccc(C)c1CC1=NCCN1
: