Target
5-hydroxytryptamine receptor 2A
Ligand
BDBM50403964
Substrate
Meas. Tech.
ChEBML_2508
IC50
1.9±n/a nM
Citation
 Andrés, JIAlcázar, JAlonso, JMDíaz, AFernández, JGil, PIturrino, LMatesanz, EMeert, TFMegens, ASipido, VK Synthesis and structure-activity relationship of 2-(aminoalkyl)-2,3,3a,8-tetrahydrodibenzo[c,f]isoxazolo[2,3-a]azepine derivatives: a novel series of 5-HT(2A/2C) receptor antagonists. Part 1. Bioorg Med Chem Lett 12:243-8 (2001)  
Target
Name:
5-hydroxytryptamine receptor 2A
Synonyms:
5-HT-2 5-HT2A 5-hydroxytryptamine receptor 2A (5HT-2A) 5HT2A_HUMAN HTR2A | Serotonin receptor 2A
Type:
undefined
Mol. Mass.:
52607.65
Organism:
Homo sapiens (Human)
Description:
P28223
Residue:
471
  
Inhibitor
Name:
BDBM50403964
Synonyms:
CHEMBL310183 | R-95292
Type:
Small organic molecule
Emp. Form.:
C18H19ClN2O2
Mol. Mass.:
330.809
SMILES:
CN(C)CC1CC2N(O1)c1cc(Cl)ccc1Oc1ccccc21
: