Target
Coagulation factor X
Ligand
BDBM50404104
Substrate
Meas. Tech.
ChEBML_48837
Ki
16±n/a nM
Citation
 Chou, YLDavey, DDEagen, KAGriedel, BDKaranjawala, RPhillips, GBSacchi, KLShaw, KJWu, SCLentz, DLiang, AMTrinh, LMorrissey, MMKochanny, MJ Structure-activity relationships of substituted benzothiophene-anthranilamide factor Xa inhibitors. Bioorg Med Chem Lett 13:507-11 (2003)  
Target
Name:
Coagulation factor X
Synonyms:
Activated coagulation factor X (FXa) Coagulation factor X precursor F10 Factor X heavy chain Factor Xa Stuart-Prower factor
Type:
Enzyme
Mol. Mass.:
54726.60
Organism:
Homo sapiens (Human)
Description:
Residue:
488
  
Inhibitor
Name:
BDBM50404104
Synonyms:
CHEMBL53011
Type:
Small organic molecule
Emp. Form.:
C24H19ClN2O3S
Mol. Mass.:
450.937
SMILES:
COc1ccc(NC(=O)c2cc(C)ccc2NC(=O)c2sc3ccccc3c2Cl)cc1
: