Target
Coagulation factor X
Ligand
BDBM50404133
Substrate
Meas. Tech.
ChEBML_48837
Ki
1.8±n/a nM
Citation
 Chou, YLDavey, DDEagen, KAGriedel, BDKaranjawala, RPhillips, GBSacchi, KLShaw, KJWu, SCLentz, DLiang, AMTrinh, LMorrissey, MMKochanny, MJ Structure-activity relationships of substituted benzothiophene-anthranilamide factor Xa inhibitors. Bioorg Med Chem Lett 13:507-11 (2003)  
Target
Name:
Coagulation factor X
Synonyms:
Activated coagulation factor X (FXa) Coagulation factor X precursor F10 Factor X heavy chain Factor Xa Stuart-Prower factor
Type:
Enzyme
Mol. Mass.:
54726.60
Organism:
Homo sapiens (Human)
Description:
Residue:
488
  
Inhibitor
Name:
BDBM50404133
Synonyms:
CHEMBL356112
Type:
Small organic molecule
Emp. Form.:
C23H15Cl3N2O2S
Mol. Mass.:
489.801
SMILES:
Cc1cc(Cl)cc(C(=O)Nc2ccc(Cl)cc2)c1NC(=O)c1sc2ccccc2c1Cl
: