Target
Coagulation factor X
Ligand
BDBM50404117
Substrate
Meas. Tech.
ChEBML_48837
Ki
7.2±n/a nM
Citation
 Chou, YLDavey, DDEagen, KAGriedel, BDKaranjawala, RPhillips, GBSacchi, KLShaw, KJWu, SCLentz, DLiang, AMTrinh, LMorrissey, MMKochanny, MJ Structure-activity relationships of substituted benzothiophene-anthranilamide factor Xa inhibitors. Bioorg Med Chem Lett 13:507-11 (2003)  
Target
Name:
Coagulation factor X
Synonyms:
Activated coagulation factor X (FXa) Coagulation factor X precursor F10 Factor X heavy chain Factor Xa Stuart-Prower factor
Type:
Enzyme
Mol. Mass.:
54726.60
Organism:
Homo sapiens (Human)
Description:
Residue:
488
  
Inhibitor
Name:
BDBM50404117
Synonyms:
CHEMBL146641
Type:
Small organic molecule
Emp. Form.:
C23H16Cl2N2O2S
Mol. Mass.:
455.356
SMILES:
Cc1ccc(C(=O)Nc2ccc(Cl)cc2)c(NC(=O)c2sc3ccccc3c2Cl)c1
: