Target
5-hydroxytryptamine receptor 2B
Ligand
BDBM50404639
Substrate
Meas. Tech.
ChEMBL_2901 (CHEMBL875914)
Kd
302±n/a nM
Citation
 Glennon, RALiebowitz, SMLeming-Doot, DRosecrans, JA Demethyl analogues of psychoactive methoxyphenalkylamines: synthesis and serotonin receptor affinities. J Med Chem 23:990-4 (1980)  
Target
Name:
5-hydroxytryptamine receptor 2B
Synonyms:
5-HT2B 5HT2B_RAT Serotonin 2b (5-HT2b) receptor Srl
Type:
Enzyme Catalytic Domain
Mol. Mass.:
53668.47
Organism:
RAT
Description:
5-HT2B HTR2B RAT::P30994
Residue:
479
  
Inhibitor
Name:
BDBM50404639
Synonyms:
CHEMBL174449
Type:
Small organic molecule
Emp. Form.:
C18H23NO2
Mol. Mass.:
285.3807
SMILES:
COc1ccc(OCc2ccccc2)c(CCN(C)C)c1
: