Target
5-hydroxytryptamine receptor 2B
Ligand
BDBM50404645
Substrate
Meas. Tech.
ChEMBL_2900 (CHEMBL617617)
Kd
100±n/a nM
Citation
 Glennon, RALiebowitz, SMLeming-Doot, DRosecrans, JA Demethyl analogues of psychoactive methoxyphenalkylamines: synthesis and serotonin receptor affinities. J Med Chem 23:990-4 (1980)  
Target
Name:
5-hydroxytryptamine receptor 2B
Synonyms:
5-HT2B 5HT2B_RAT Serotonin 2b (5-HT2b) receptor Srl
Type:
Enzyme Catalytic Domain
Mol. Mass.:
53668.47
Organism:
RAT
Description:
5-HT2B HTR2B RAT::P30994
Residue:
479
  
Inhibitor
Name:
BDBM50404645
Synonyms:
CHEMBL175205
Type:
Small organic molecule
Emp. Form.:
C10H15NO2
Mol. Mass.:
181.2316
SMILES:
COc1ccc(O)c(CC(C)N)c1
: