Target
5-hydroxytryptamine receptor 2B
Ligand
BDBM50404734
Substrate
Meas. Tech.
ChEMBL_2918 (CHEMBL617633)
Kd
4266±n/a nM
Citation
 Glennon, RAJacyno, JMSalley, JJ 2,3-dihydro and carbocyclic analogues of tryptamines: interaction with serotonin receptors. J Med Chem 25:68-70 (1982)  
Target
Name:
5-hydroxytryptamine receptor 2B
Synonyms:
5-HT2B 5HT2B_RAT Serotonin 2b (5-HT2b) receptor Srl
Type:
Enzyme Catalytic Domain
Mol. Mass.:
53668.47
Organism:
RAT
Description:
5-HT2B HTR2B RAT::P30994
Residue:
479
  
Inhibitor
Name:
BDBM50404734
Synonyms:
CHEMBL161751
Type:
Small organic molecule
Emp. Form.:
C12H17N
Mol. Mass.:
175.2701
SMILES:
CNCCC1CCc2ccccc12
: